Target
Indoleamine 2,3-dioxygenase 1
Ligand
BDBM317224
Substrate
Meas. Tech.
Enzymatic IDO Assay
IC50
>10000±n/a nM
Citation
 Kumar, SWaldo, JJaipuri, FMautino, M Tricyclic compounds as inhibitors of immunosuppression mediated by tryptophan metabolization US Patent  US9617272 Publication Date 4/11/2017 
Target
Name:
Indoleamine 2,3-dioxygenase 1
Synonyms:
I23O1_HUMAN IDO-1 INDO Indoleamine 2,3-dioxygenase | Indoleamine-pyrrole 2,3-dioxygenase
Type:
Enzyme
Mol. Mass.:
45330.80
Organism:
Homo sapiens (Human)
Description:
P14902
Residue:
403
  
Inhibitor
Name:
BDBM317224
Synonyms:
US9617272, Compound 43 | US9981973, Compound 43
Type:
Small organic molecule
Emp. Form.:
C17H19N3O
Mol. Mass.:
281.3523
SMILES:
O=C(CC1c2ccccc2-c2nncn12)C1CCCCC1
: