Target
Sigma non-opioid intracellular receptor 1
Ligand
BDBM317230
Substrate
Meas. Tech.
Binding Assay
Ki
100.0±n/a nM
Citation
 Alcalde-Pais, MDiaz Fernández, JLMesquida-Estevez, MPaloma-Romeu, L Imidazo[2,1-b]thiazole derivatives, their preparation and use as medicaments US Patent  US9617281 Publication Date 4/11/2017 
Target
Name:
Sigma non-opioid intracellular receptor 1
Synonyms:
OPRS1 SIGMAR1 Sigma non-opioid intracellular receptor 1 Sigma1-receptor Sterol isomerase-like protein
Type:
Protein
Mol. Mass.:
25307.17
Organism:
Cavia porcellus (Guinea pig)
Description:
Q60492
Residue:
223
  
Inhibitor
Name:
BDBM317230
Synonyms:
2-(Azepan-1- ylmethyl)-6- phenylimidazo[2,1- b]thiazole maleate | US9617281, Compound 12
Type:
Small organic molecule
Emp. Form.:
C18H21N3S
Mol. Mass.:
311.444
SMILES:
C(N1CCCCCC1)c1cn2cc(nc2s1)-c1ccccc1
: