Target
Interleukin-1 receptor-associated kinase 4
Ligand
BDBM317270
Substrate
Meas. Tech.
Biochemical Assay
IC50
<100±n/a nM
Citation
 Jenkins, TVessels, J Macrocyclic compounds as IRAK4 inhibitors for the treatment of inflammatory diseases US Patent  US9617282 Publication Date 4/11/2017 
Target
Name:
Interleukin-1 receptor-associated kinase 4
Synonyms:
IRAK-4 IRAK4_HUMAN Interleukin-1 receptor-associated kinase 4 (IRAK4) | Renal carcinoma antigen NY-REN-64
Type:
Protein
Mol. Mass.:
51519.08
Organism:
Homo sapiens (Human)
Description:
Q9NWZ3
Residue:
460
  
Inhibitor
Name:
BDBM317270
Synonyms:
US9617282, Example 40
Type:
Small organic molecule
Emp. Form.:
C23H26N6O4
Mol. Mass.:
450.4903
SMILES:
O=C1Nc2cn(nc2C(=O)NCCCCCc2cc(ccn2)-c2nc1co2)C1CCOCC1
: