Target
Dual specificity protein kinase TTK
Ligand
BDBM317464
Substrate
Meas. Tech.
Radioactivity Based Kinase Assay
IC50
16.0±n/a nM
Citation
 Zhu, DBoylan, JXu, SRiggs, JShi, TWurmser, AMikolon, DDeyanat-Yazdi, G Methods of treating a cancer using substituted pyrrolopyrimidine compounds, compositions thereof US Patent  US9623028 Publication Date 4/18/2017 
Target
Name:
Dual specificity protein kinase TTK
Synonyms:
Dual specificity protein kinase (TTK) MPS1 Monopolar Spindle 1 (MPS1) Monopolar Spindle 1 Kinase (MPS1) TTK | TTK_HUMAN
Type:
Protein
Mol. Mass.:
97086.79
Organism:
Homo sapiens (Human)
Description:
P33981
Residue:
857
  
Inhibitor
Name:
BDBM317464
Synonyms:
4-(4-(cyclopentyloxy)-5-(6- ethoxypyridin-3-yl)-7H- pyrrolo[2,3-d]pyrimidin-2- ylamino)-3-methoxy-N- methylbenzamide | US9623028, Compound 67
Type:
Small organic molecule
Emp. Form.:
C27H30N6O4
Mol. Mass.:
502.5649
SMILES:
CCOc1ccc(cn1)-c1c[nH]c2nc(Nc3ccc(cc3OC)C(=O)NC)nc(OC3CCCC3)c12
: