Target
Dual specificity tyrosine-phosphorylation-regulated kinase 1A
Ligand
BDBM10910
Substrate
myelin basic protein
Meas. Tech.
Kinase Inhibition Assay
pH
7.2±n/a
Temperature
303.15±n/a K
IC50
250000±n/a nM
Citation
 Tang, LLi, MHCao, PWang, FChang, WRBach, SReinhardt, JFerandin, YGalons, HWan, YGray, NMeijer, LJiang, TLiang, DC Crystal structure of pyridoxal kinase in complex with roscovitine and derivatives. J Biol Chem 280:31220-9 (2005)  
Target
Name:
Dual specificity tyrosine-phosphorylation-regulated kinase 1A
Synonyms:
DYR1A_HUMAN DYRK1A Dual specificity YAK1-related kinase 1A (Dyrk1A) Dual-specificity tyrosine-phosphorylation regulated kinase 1A HP86 MNBH
Type:
Enzyme
Mol. Mass.:
85616.61
Organism:
Homo sapiens (Human)
Description:
Q13627
Residue:
763
  
Inhibitor
Name:
BDBM10910
Synonyms:
(2R)-2-{[6-(benzyloxy)-9-(propan-2-yl)-9H-purin-2-yl]amino}butan-1-ol R-2-(6-Benzyloxy-9-isopropyl-9H-purin-2-yl-amino)-butan-1-ol
Type:
Small organic molecule
Emp. Form.:
C19H25N5O2
Mol. Mass.:
355.4341
SMILES:
CC[C@H](CO)Nc1nc(OCc2ccccc2)c2ncn(C(C)C)c2n1
:
Substrate
Name:
myelin basic protein
Synonyms:
MBP Myelin A1 protein biotin-MBP protein | biotin-myelin basic protein
Type:
Other Protein Type
Mol. Mass.:
33133.33
Organism:
Homo sapiens (Human)
Description:
Residue:
304