Target
Isocitrate dehydrogenase [NADP] cytoplasmic [R132H]
Ligand
BDBM317507
Substrate
Meas. Tech.
Enzymatic Assay
IC50
>10000±n/a nM
Citation
 Lin, JEricsson, ACampbell, AGustafson, GWang, ZDiebold, RBAshwell, SLancia, Jr., DRCaravella, JALu, W Fused-bicyclic aryl quinolinone derivatives as mutant-isocitrate dehydrogenase inhibitors US Patent  US9624175 Publication Date 4/18/2017 
Target
Name:
Isocitrate dehydrogenase [NADP] cytoplasmic [R132H]
Synonyms:
Cytosolic NADP-isocitrate dehydrogenase (IDH1)(R132H) IDH1 R132H IDHC_HUMAN Isocitrate dehydrogenase 1 mutant (R132H) Isocitrate dehydrogenase [NADP] cytoplasmic (IDH1)(R132H) PICD
Type:
Protein
Mol. Mass.:
46641.74
Organism:
Homo sapiens (Human)
Description:
Human IDH1 R132H (SEQ ID No. 2 in patent). First three are removed. Google patent parsed wrong.
Residue:
414
  
Inhibitor
Name:
BDBM317507
Synonyms:
6-chloro-3-{[(5-oxo-5,6,7,8-tetrahydronaphthalen-1-yl)amino]methyl}-1,2-dihydroquinolin-2-one | US9624175, Compound I-22
Type:
Small organic molecule
Emp. Form.:
C20H17ClN2O2
Mol. Mass.:
352.814
SMILES:
Clc1ccc2[nH]c(=O)c(CNc3cccc4C(=O)CCCc34)cc2c1
: