Target
Isocitrate dehydrogenase [NADP] cytoplasmic [R132H]
Ligand
BDBM317533
Substrate
Meas. Tech.
Enzymatic Assay
IC50
<100±n/a nM
Citation
 Lin, JEricsson, ACampbell, AGustafson, GWang, ZDiebold, RBAshwell, SLancia, Jr., DRCaravella, JALu, W Fused-bicyclic aryl quinolinone derivatives as mutant-isocitrate dehydrogenase inhibitors US Patent  US9624175 Publication Date 4/18/2017 
Target
Name:
Isocitrate dehydrogenase [NADP] cytoplasmic [R132H]
Synonyms:
Cytosolic NADP-isocitrate dehydrogenase (IDH1)(R132H) IDH1 R132H IDHC_HUMAN Isocitrate dehydrogenase 1 mutant (R132H) Isocitrate dehydrogenase [NADP] cytoplasmic (IDH1)(R132H) PICD
Type:
Protein
Mol. Mass.:
46641.74
Organism:
Homo sapiens (Human)
Description:
Human IDH1 R132H (SEQ ID No. 2 in patent). First three are removed. Google patent parsed wrong.
Residue:
414
  
Inhibitor
Name:
BDBM317533
Synonyms:
6-chloro-3-[(1S)-1-({1-methyl-2-oxo-1H,2H,4H-pyrimido[4,5-d][1,3]oxazin-7-yl}amino)ethyl]-7-(pyridin-2-ylmethoxy)-1,2-dihydroquinolin-2-one | US9624175, Compound I-48
Type:
Small organic molecule
Emp. Form.:
C24H21ClN6O4
Mol. Mass.:
492.914
SMILES:
C[C@H](Nc1ncc2COC(=O)N(C)c2n1)c1cc2cc(Cl)c(OCc3ccccn3)cc2[nH]c1=O
: