Target
Isocitrate dehydrogenase [NADP] cytoplasmic [1-390,401-414,R132C]
Ligand
BDBM317538
Substrate
IC50
>10000±n/a nM
Citation
 Lin, JEricsson, ACampbell, AGustafson, GWang, ZDiebold, RBAshwell, SLancia, Jr., DRCaravella, JALu, W Fused-bicyclic aryl quinolinone derivatives as mutant-isocitrate dehydrogenase inhibitors US Patent  US9624175 Publication Date 4/18/2017 
Target
Name:
Isocitrate dehydrogenase [NADP] cytoplasmic [1-390,401-414,R132C]
Synonyms:
IDH1 Isocitrate dehydrogenase [NADP] cytoplasmic (IDH1)(R132C) | PICD
Type:
Enzyme Catalytic Domain
Mol. Mass.:
45318.79
Organism:
Homo sapiens (Human)
Description:
O75874[1-390,401-414,R132C]
Residue:
404
  
Inhibitor
Name:
BDBM317538
Synonyms:
6-chloro-7-fluoro-3-[(1R)-1-({1-methyl-2-oxo-1H,2H,4H-pyrimido[4,5-d][1,3]oxazin-7-yl}amino)ethyl]-1,2-dihydroquinolin-2-one | US9624175, Compound I-53
Type:
Small organic molecule
Emp. Form.:
C18H15ClFN5O3
Mol. Mass.:
403.795
SMILES:
C[C@@H](Nc1ncc2COC(=O)N(C)c2n1)c1cc2cc(Cl)c(F)cc2[nH]c1=O
: