Target
Acetylcholinesterase
Ligand
BDBM10945
Substrate
BDBM8959
Meas. Tech.
Enzyme Inhibition Assay
pH
7.4±n/a
Temperature
310.15±n/a K
IC50
35.9±7.5 nM
Citation
 Feng, SWang, ZHe, XZheng, SXia, YJiang, HTang, XBai, D Bis-huperzine B: highly potent and selective acetylcholinesterase inhibitors. J Med Chem 48:655-7 (2005)  
Target
Name:
Acetylcholinesterase
Synonyms:
ACES_RAT Acetylcholinesterase and butyrylcholinesterase (AChE and BChE) Acetylcholinesterase, AChE | Ache
Type:
Enzyme
Mol. Mass.:
68193.62
Organism:
Rattus norvegicus (rat)
Description:
P37136
Residue:
614
  
Inhibitor
Name:
BDBM10945
Synonyms:
(1R,10R)-16-methyl-14-{3-[methyl({6-[methyl({3-[(1R,10R)-16-methyl-5-oxo-6,14-diazatetracyclo[7.5.3.0^{1,10}.0^{2,7}]heptadeca-2(7),3,16-trien-14-yl]-3-oxopropyl})amino]hexyl})amino]propanoyl}-6,14-diazatetracyclo[7.5.3.0^{1,10}.0^{2,7}]heptadeca-2(7),3,16-trien-5-one bis(14)-HupB
Type:
Small organic molecule
Emp. Form.:
C46H64N6O4
Mol. Mass.:
765.0382
SMILES:
CN(CCCCCCN(C)CCC(=O)N1CCC[C@@H]2C3Cc4[nH]c(=O)ccc4[C@]12CC(C)=C3)CCC(=O)N1CCC[C@@H]2C3Cc4[nH]c(=O)ccc4[C@]12CC(C)=C3
:
Substrate
Name:
BDBM8959
Synonyms:
(2-Mercaptoethyl)trimethylammonium iodide acetate Acetylthiocholine acetylthiocholine chloride | acetylthiocholine iodide
Type:
Small organic molecule
Emp. Form.:
C7H16NOS
Mol. Mass.:
162.272
SMILES:
CC(=O)SCC[N+](C)(C)C
: