Target
Cyclin-dependent kinase 2/G1/S-specific cyclin-E1
Ligand
BDBM187121
Substrate
Meas. Tech.
CDK2/CycE High ATP Kinase Assay
pH
8±n/a
IC50
625±0.0 nM
Comments
extracted
Citation
 Lücking, UBöhnke, NScholz, ALienau, PSiemeister, GBömer, UKosemund, DBohlmann, RZorn, L 5-fluoro-N-(pyridin-2-yl)pyridin-2-amine derivatives containing a sulfone group US Patent  US9670161 Publication Date 6/6/2017 
Target
Name:
Cyclin-dependent kinase 2/G1/S-specific cyclin-E1
Synonyms:
CDK2/CycE CDK2/E Cyclin-Dependent Kinase 2 (CDK2) Cyclin-dependent kinase 2/cyclin E1
Type:
Protein
Mol. Mass.:
Description:
Components:
This complex has 2 components.
Component 1
Name:
Cyclin-dependent kinase 2
Synonyms:
CDK2 CDK2_HUMAN Cell division protein kinase 2 Protein cereblon/Cyclin-dependent kinase 2 | p33 protein kinase
Type:
Enzyme Subunit
Mol. Mass.:
33938.17
Organism:
Homo sapiens (Human)
Description:
P24941
Residue:
298
  
Component 2
Name:
G1/S-specific cyclin-E1
Synonyms:
CCNE CCNE1_HUMAN
Type:
Enzyme Subunit
Mol. Mass.:
47073.17
Organism:
Homo sapiens (Human)
Description:
Residue:
410
  
Inhibitor
Name:
BDBM187121
Synonyms:
US9670161, 2 5-Fluoro-4-(4-fluoro-2-methoxyphenyl)-N-{6-methyl-4-[(methylsulfonyl)methyl]pyridin-2-yl}pyridin-2-amine
Type:
Small organic molecule
Emp. Form.:
C20H19F2N3O3S
Mol. Mass.:
419.445
SMILES:
COc1cc(F)ccc1-c1cc(Nc2cc(CS(C)(=O)=O)cc(C)n2)ncc1F
: