Target
Indoleamine 2,3-dioxygenase 1
Ligand
BDBM317556
Substrate
Meas. Tech.
Biological Activity Assay
IC50
5.00±n/a nM
Citation
 Balog, JAHuang, AChen, BChen, LShan, W IDO inhibitors US Patent  US9624188 Publication Date 4/18/2017 
Target
Name:
Indoleamine 2,3-dioxygenase 1
Synonyms:
I23O1_HUMAN IDO-1 INDO Indoleamine 2,3-dioxygenase | Indoleamine-pyrrole 2,3-dioxygenase
Type:
Enzyme
Mol. Mass.:
45330.80
Organism:
Homo sapiens (Human)
Description:
P14902
Residue:
403
  
Inhibitor
Name:
BDBM317556
Synonyms:
(r)-3-(3-(2-(4-cyanophenyl)acetamido)-4-(diisobutylamino)phenyl)butanoic acid | US9624188, 45
Type:
Small organic molecule
Emp. Form.:
C27H35N3O3
Mol. Mass.:
449.5851
SMILES:
CC(C)CN(CC(C)C)c1ccc(cc1NC(=O)Cc1ccc(cc1)C#N)[C@H](C)CC(O)=O
: