Target
Sodium channel protein type 9 subunit alpha
Ligand
BDBM190561
Substrate
Meas. Tech.
Electrophysiological Assay
Ki
2262±2262 nM
Citation
 Yao, J Heteroaryl compounds as sodium channel blockers US Patent  US9624194 Publication Date 4/18/2017 
Target
Name:
Sodium channel protein type 9 subunit alpha
Synonyms:
NENA Peripheral sodium channel 1 SCN9A_HUMAN Voltage-gated sodium channel subunit Nav1.7 hNE-Na
Type:
Protein
Mol. Mass.:
226375.97
Organism:
Homo sapiens (Human)
Description:
Q15858
Residue:
1988
  
Inhibitor
Name:
BDBM190561
Synonyms:
US9181185, 19 | US9624194, Compound 19
Type:
Small organic molecule
Emp. Form.:
C22H16F3N3O4
Mol. Mass.:
443.3753
SMILES:
NC(=O)[C@H](O)[C@@H](O)c1cccc(n1)-c1ccc(Oc2ccc(c(c2)C#N)C(F)(F)F)cc1
: