Target
Amine oxidase [flavin-containing] B
Ligand
BDBM10994
Substrate
BDBM10999
Meas. Tech.
MAO A and MAO B Activity Measurements
pH
7.5±n/a
Temperature
298.15±n/a K
Ki
31000±n/a nM
Citation
 Binda, CHubalek, FLi, MHerzig, YSterling, JEdmondson, DEMattevi, A Binding of rasagiline-related inhibitors to human monoamine oxidases: a kinetic and crystallographic analysis. J Med Chem 48:8148-54 (2005)  
Target
Name:
Amine oxidase [flavin-containing] B
Synonyms:
AOFB_HUMAN MAOB Monoamine oxidase type B (MAO B) Monoamine oxidase type B (MAOB)
Type:
Protein
Mol. Mass.:
58768.76
Organism:
Homo sapiens (Human)
Description:
P27338
Residue:
520
  
Inhibitor
Name:
BDBM10994
Synonyms:
(1R)-1-(prop-2-yn-1-ylamino)-2,3-dihydro-1H-inden-4-ol R-4HPAI | rasagiline analog
Type:
Small organic molecule
Emp. Form.:
C12H13NO
Mol. Mass.:
187.2377
SMILES:
Oc1cccc2[C@@H](CCc12)NCC#C
:
Substrate
Name:
BDBM10999
Synonyms:
Benzenemethanamine CHEMBL522 phenylmethanamine
Type:
Small organic molecule
Emp. Form.:
C7H9N
Mol. Mass.:
107.1531
SMILES:
NCc1ccccc1
: