Target
Neutrophil elastase
Ligand
BDBM211894
Substrate
Meas. Tech.
Human Neutrophil Elastase Assay
pH
7.5±n/a
Temperature
298.15±n/a K
IC50
<1.00±n/a nM
Comments
extracted
Citation
 Gnamm, COost, TPeters, SHoesch, HRies, UJ Substituted bicyclic dihydropyrimidinones and their use as inhibitors of neutrophil elastase activity US Patent  US9670166 Publication Date 6/6/2017 
Target
Name:
Neutrophil elastase
Synonyms:
Bone marrow serine protease Coagulation factor X ELANE Elastase HLE Leukocyte elastase Medullasin Neutrophil elastase (HNE) PMN elastase Trypsin
Type:
Enzyme
Mol. Mass.:
28532.38
Organism:
Homo sapiens (Human)
Description:
P08246
Residue:
267
  
Inhibitor
Name:
BDBM211894
Synonyms:
US9290459, 47.9 | US9670166, 47.9
Type:
Small organic molecule
Emp. Form.:
C26H23F3N4O6S
Mol. Mass.:
576.544
SMILES:
COCCNC(=O)N1[C@@H](C2=C(CCC2=O)N(C1=O)c1cccc(c1)C(F)(F)F)c1ccc(cc1S(C)(=O)=O)C#N
: