Target
Amine oxidase [flavin-containing] B
Ligand
BDBM11020
Substrate
BDBM11019
Meas. Tech.
MAO Inhibition Assay
pH
7.4±n/a
Temperature
298.15±n/a K
Ki
800±n/a nM
Citation
 Hubalek, FBinda, CKhalil, ALi, MMattevi, ACastagnoli, NEdmondson, DE Demonstration of isoleucine 199 as a structural determinant for the selective inhibition of human monoamine oxidase B by specific reversible inhibitors. J Biol Chem 280:15761-6 (2005)  
Target
Name:
Amine oxidase [flavin-containing] B
Synonyms:
AOFB_HUMAN MAOB Monoamine oxidase type B (MAO B) Monoamine oxidase type B (MAOB)
Type:
Protein
Mol. Mass.:
58768.76
Organism:
Homo sapiens (Human)
Description:
P27338
Residue:
520
  
Inhibitor
Name:
BDBM11020
Synonyms:
1,4-diphenyl-2-butene (DPB) | [(2E)-4-phenylbut-2-en-1-yl]benzene
Type:
Small organic molecule
Emp. Form.:
C16H16
Mol. Mass.:
208.2982
SMILES:
C(\C=C\Cc1ccccc1)c1ccccc1
:
Substrate
Name:
BDBM11019
Synonyms:
1-methyl-4-(1-methyl-1H-pyrrol-2-yl)-1,2,3,6-tetrahydropyridine MMTP
Type:
Small organic molecule
Emp. Form.:
C11H16N2
Mol. Mass.:
176.2581
SMILES:
CN1CCC(=CC1)c1cccn1C
: