Target
Amine oxidase [flavin-containing] B
Ligand
BDBM11020
Substrate
BDBM10999
Meas. Tech.
MAO Inhibition Assay
pH
7.5±n/a
Temperature
298.15±n/a K
Ki
700±n/a nM
Citation
 Hubalek, FBinda, CKhalil, ALi, MMattevi, ACastagnoli, NEdmondson, DE Demonstration of isoleucine 199 as a structural determinant for the selective inhibition of human monoamine oxidase B by specific reversible inhibitors. J Biol Chem 280:15761-6 (2005)  
Target
Name:
Amine oxidase [flavin-containing] B
Synonyms:
AOFB_HUMAN MAOB Monoamine oxidase type B (MAO B) Monoamine oxidase type B (MAOB)
Type:
Protein
Mol. Mass.:
58768.76
Organism:
Homo sapiens (Human)
Description:
P27338
Residue:
520
  
Inhibitor
Name:
BDBM11020
Synonyms:
1,4-diphenyl-2-butene (DPB) | [(2E)-4-phenylbut-2-en-1-yl]benzene
Type:
Small organic molecule
Emp. Form.:
C16H16
Mol. Mass.:
208.2982
SMILES:
C(\C=C\Cc1ccccc1)c1ccccc1
:
Substrate
Name:
BDBM10999
Synonyms:
Benzenemethanamine CHEMBL522 phenylmethanamine
Type:
Small organic molecule
Emp. Form.:
C7H9N
Mol. Mass.:
107.1531
SMILES:
NCc1ccccc1
: