Target
Tyrosine-protein kinase BTK
Ligand
BDBM317624
Substrate
Meas. Tech.
Inhibition Assay
IC50
29.5±n/a nM
Citation
 Lopez-Tapia, FJSo, SQiao, QDominique, R Inhibitors of bruton's tyrosine kinase US Patent  US9624201 Publication Date 4/18/2017 
Target
Name:
Tyrosine-protein kinase BTK
Synonyms:
AGMX1 Agammaglobulinaemia tyrosine kinase B cell progenitor kinase BPK BTK_HUMAN Tyrosine Kinase BTK Tyrosine-protein kinase BTK (BTK)
Type:
Enzyme
Mol. Mass.:
76289.95
Organism:
Homo sapiens (Human)
Description:
Q06187
Residue:
659
  
Inhibitor
Name:
BDBM317624
Synonyms:
3-(2-{5- Amino-1-[4- (2,3-difluoro- phenoxy)-2- methyl- phenyl]-1H- pyrazole-4- carbonyl}-1H- indol-4- ylmethyl)- benzonitrile US11104668, Compound 13 | US9624201, Compound 13
Type:
Small organic molecule
Emp. Form.:
C33H23F2N5O2
Mol. Mass.:
559.5648
SMILES:
Cc1cc(Oc2cccc(F)c2F)ccc1-n1ncc(C(=O)c2cc3c(Cc4cccc(c4)C#N)cccc3[nH]2)c1N
: