Target
Serine/threonine-protein kinase B-raf [V600E]
Ligand
BDBM317694
Substrate
Meas. Tech.
Biochemical activity
IC50
<100.0±n/a nM
Citation
 Ibrahim, PZhang, CSpevak, WZhang, JWu, GLin, JCho, HNespi, MShi, SEwing, TZhang, Y Compounds and methods for kinase modulation, and indications therefor US Patent  US9624213 Publication Date 4/18/2017 
Target
Name:
Serine/threonine-protein kinase B-raf [V600E]
Synonyms:
B-RAF V600E B-Raf Protein Kinase Mutant (V600E) BRAF BRAF mutant V600E BRAF_HUMAN Protein mono-ADP-ribosyltransferase (PARP3) RAFB1 Serine/threonine-protein kinase B-raf (V600E) V-RAF murine sarcoma viral oncogene homologue B1 mutant (BRAF V600E)
Type:
Mol. Mass.:
84474.98
Organism:
Homo sapiens (Human)
Description:
P15056 V600E
Residue:
766
  
Inhibitor
Name:
BDBM317694
Synonyms:
US11337976, Compound P-0065 US9624213, Compound P-0065
Type:
Small organic molecule
Emp. Form.:
C22H20FN5O5S
Mol. Mass.:
485.488
SMILES:
COCCS(=O)(=O)Nc1cccc(C(=O)c2c[nH]c3ncc(cc23)-c2cnc(OC)nc2)c1F
: