Target
Nuclear receptor ROR-gamma
Ligand
BDBM317865
Substrate
Meas. Tech.
Binding Assay
Ki
>1000±n/a nM
Citation
 Claremon, DADillard, LWDong, CFan, YJia, LLiu, ZLotesta, SDMarcus, ASingh, SBTice, CMYuan, JZhao, WZheng, YZhuang, L Dihydropyrrolopyridine inhibitors of ROR-gamma US Patent  US9624217 Publication Date 4/18/2017 
Target
Name:
Nuclear receptor ROR-gamma
Synonyms:
NR1F3 Nuclear receptor ROR-gamma (RORC) RAR-related orphan receptor C (RORc) RORG RZRG Retinoid-related orphan receptor-gamma (RORc)
Type:
Enzyme Catalytic Domain
Mol. Mass.:
58218.40
Organism:
Homo sapiens (Human)
Description:
P51449
Residue:
518
  
Inhibitor
Name:
BDBM317865
Synonyms:
US10399976, Compound 18 US11535614, Compound 18 | US9624217, Compound 18
Type:
Small organic molecule
Emp. Form.:
C26H28ClN3O3S
Mol. Mass.:
498.037
SMILES:
CC(C)[C@H]1N(Cc2ccc(Cl)cc2)Cc2cc(cnc12)C(=O)NCc1ccc(cc1)S(C)(=O)=O
: