Target
Nuclear receptor ROR-gamma
Ligand
BDBM317907
Substrate
Meas. Tech.
Binding Assay
Ki
550±n/a nM
Citation
 Claremon, DADillard, LWDong, CFan, YJia, LLiu, ZLotesta, SDMarcus, ASingh, SBTice, CMYuan, JZhao, WZheng, YZhuang, L Dihydropyrrolopyridine inhibitors of ROR-gamma US Patent  US9624217 Publication Date 4/18/2017 
Target
Name:
Nuclear receptor ROR-gamma
Synonyms:
NR1F3 Nuclear receptor ROR-gamma (RORC) RAR-related orphan receptor C (RORc) RORG RZRG Retinoid-related orphan receptor-gamma (RORc)
Type:
Enzyme Catalytic Domain
Mol. Mass.:
58218.40
Organism:
Homo sapiens (Human)
Description:
P51449
Residue:
518
  
Inhibitor
Name:
BDBM317907
Synonyms:
US10399976, Compound 60 US11535614, Compound 60 | US9624217, Compound 60
Type:
Small organic molecule
Emp. Form.:
C28H31F3N4O3S
Mol. Mass.:
560.631
SMILES:
CCS(=O)(=O)c1ccc(nc1)[C@H](C)NC(=O)c1cnc2[C@H](C(C)C)N(Cc3ccc(cc3)C(F)(F)F)Cc2c1
: