Target
Nuclear receptor ROR-gamma
Ligand
BDBM317931
Substrate
Meas. Tech.
Binding Assay
Ki
>1000±n/a nM
Citation
 Claremon, DADillard, LWDong, CFan, YJia, LLiu, ZLotesta, SDMarcus, ASingh, SBTice, CMYuan, JZhao, WZheng, YZhuang, L Dihydropyrrolopyridine inhibitors of ROR-gamma US Patent  US9624217 Publication Date 4/18/2017 
Target
Name:
Nuclear receptor ROR-gamma
Synonyms:
NR1F3 Nuclear receptor ROR-gamma (RORC) RAR-related orphan receptor C (RORc) RORG RZRG Retinoid-related orphan receptor-gamma (RORc)
Type:
Enzyme Catalytic Domain
Mol. Mass.:
58218.40
Organism:
Homo sapiens (Human)
Description:
P51449
Residue:
518
  
Inhibitor
Name:
BDBM317931
Synonyms:
US10399976, Compound 84 US11535614, Compound 84 | US9624217, Compound 84
Type:
Small organic molecule
Emp. Form.:
C24H24F3N5O
Mol. Mass.:
455.4755
SMILES:
CC(C)[C@@H]1N(Cc2ccc(cc2)C(F)(F)F)Cc2cc(cnc12)C(=O)NCc1cccnn1
: