Target
Nuclear receptor ROR-gamma
Ligand
BDBM317961
Substrate
Meas. Tech.
Binding Assay
Ki
>1000±n/a nM
Citation
 Claremon, DADillard, LWDong, CFan, YJia, LLiu, ZLotesta, SDMarcus, ASingh, SBTice, CMYuan, JZhao, WZheng, YZhuang, L Dihydropyrrolopyridine inhibitors of ROR-gamma US Patent  US9624217 Publication Date 4/18/2017 
Target
Name:
Nuclear receptor ROR-gamma
Synonyms:
NR1F3 Nuclear receptor ROR-gamma (RORC) RAR-related orphan receptor C (RORc) RORG RZRG Retinoid-related orphan receptor-gamma (RORc)
Type:
Enzyme Catalytic Domain
Mol. Mass.:
58218.40
Organism:
Homo sapiens (Human)
Description:
P51449
Residue:
518
  
Inhibitor
Name:
BDBM317961
Synonyms:
US10399976, Compound 114 US11535614, Compound 114 | US9624217, Compound 114
Type:
Small organic molecule
Emp. Form.:
C27H33F3N4O2
Mol. Mass.:
502.5717
SMILES:
CC(C)[C@@H]1N(Cc2ccc(cc2)C(F)(F)F)Cc2cc(cnc12)C(=O)NCC1CCN(CC1)C(C)=O
: