Target
Poly [ADP-ribose] polymerase tankyrase-2
Ligand
BDBM318011
Substrate
Meas. Tech.
Biochemical Assay
IC50
69.4±17.6 nM
Citation
 Chedid, MEissa, HOEngler, TAFurness, KWRank, KBWoods, TAWrobleski, AD Pyrido[2,3-d]pyrimidin-4-one compounds as tankyrase inhibitors US Patent  US9624218 Publication Date 4/18/2017 
Target
Name:
Poly [ADP-ribose] polymerase tankyrase-2
Synonyms:
(ARTD6 or PARP5b) Poly [ADP-ribose] polymerase tankyrase-2 TNKL TNKS2_HUMAN Tankyrase 2 Tankyrase-2 Tankyrase-2 (TNKS2)
Type:
Enzyme
Mol. Mass.:
126937.16
Organism:
Homo sapiens (Human)
Description:
Q9H2K2
Residue:
1166
  
Inhibitor
Name:
BDBM318011
Synonyms:
US9624218, Example 5
Type:
Small organic molecule
Emp. Form.:
C18H24FN7O
Mol. Mass.:
373.4279
SMILES:
CC(N1CCN(CC1)c1nc2N(C)CCCc2c(=O)[nH]1)c1ncc(F)cn1
: