Target
Poly [ADP-ribose] polymerase tankyrase-1
Ligand
BDBM318032
Substrate
Meas. Tech.
Biochemical Assay
IC50
35.8±32.5 nM
Citation
 Chedid, MEissa, HOEngler, TAFurness, KWRank, KBWoods, TAWrobleski, AD Pyrido[2,3-d]pyrimidin-4-one compounds as tankyrase inhibitors US Patent  US9624218 Publication Date 4/18/2017 
Target
Name:
Poly [ADP-ribose] polymerase tankyrase-1
Synonyms:
(ARTD5 or PARP5a) PARPL Poly [ADP-ribose] polymerase tankyrase-1 TINF1 TNKS1 Tankyrase 1 Tankyrase-1 Tankyrase-1 (TNKS1)
Type:
Enzyme
Mol. Mass.:
142058.03
Organism:
Homo sapiens (Human)
Description:
O95271
Residue:
1327
  
Inhibitor
Name:
BDBM318032
Synonyms:
2-[4-[(3-Methoxy-2- pyridyl)methyl]piperazin-1-yl]-8- methyl-3,5,6,7- tetrahydropyrido[2,3-d]pyrimidin- 4-one dihydrochloride | US9624218, Example 33
Type:
Small organic molecule
Emp. Form.:
C19H26N6O2
Mol. Mass.:
370.4487
SMILES:
COc1cccnc1CN1CCN(CC1)c1nc2N(C)CCCc2c(=O)[nH]1
: