Target
Poly [ADP-ribose] polymerase tankyrase-1
Ligand
BDBM318025
Substrate
Meas. Tech.
Biochemical Assay
IC50
47.6±36.6 nM
Citation
 Chedid, MEissa, HOEngler, TAFurness, KWRank, KBWoods, TAWrobleski, AD Pyrido[2,3-d]pyrimidin-4-one compounds as tankyrase inhibitors US Patent  US9624218 Publication Date 4/18/2017 
Target
Name:
Poly [ADP-ribose] polymerase tankyrase-1
Synonyms:
(ARTD5 or PARP5a) PARPL Poly [ADP-ribose] polymerase tankyrase-1 TINF1 TNKS1 Tankyrase 1 Tankyrase-1 Tankyrase-1 (TNKS1)
Type:
Enzyme
Mol. Mass.:
142058.03
Organism:
Homo sapiens (Human)
Description:
O95271
Residue:
1327
  
Inhibitor
Name:
BDBM318025
Synonyms:
US9624218, Example 19 | US9624218, Example 34
Type:
Small organic molecule
Emp. Form.:
C18H24N6O
Mol. Mass.:
340.4228
SMILES:
CN1CCCc2c1nc([nH]c2=O)N1CCN(Cc2ccccn2)CC1
: