Target
Poly [ADP-ribose] polymerase tankyrase-1
Ligand
BDBM318034
Substrate
Meas. Tech.
Biochemical Assay
IC50
21.6±n/a nM
Citation
 Chedid, MEissa, HOEngler, TAFurness, KWRank, KBWoods, TAWrobleski, AD Pyrido[2,3-d]pyrimidin-4-one compounds as tankyrase inhibitors US Patent  US9624218 Publication Date 4/18/2017 
Target
Name:
Poly [ADP-ribose] polymerase tankyrase-1
Synonyms:
(ARTD5 or PARP5a) PARPL Poly [ADP-ribose] polymerase tankyrase-1 TINF1 TNKS1 Tankyrase 1 Tankyrase-1 Tankyrase-1 (TNKS1)
Type:
Enzyme
Mol. Mass.:
142058.03
Organism:
Homo sapiens (Human)
Description:
O95271
Residue:
1327
  
Inhibitor
Name:
BDBM318034
Synonyms:
8-Methyl-2-[4-[[3-trifluoromethyl)-2- pyridyl]methyl]piperazin-1-yl]- 3,5,6,7-tetrahydropyrido[2,3- d]pyrimidin-4-one dihydrochloride US9624218, Example 36
Type:
Small organic molecule
Emp. Form.:
C20H24F3N5O
Mol. Mass.:
407.4327
SMILES:
CN1CCCc2c1nc([nH]c2=O)N1CCN(Cc2ccccc2C(F)(F)F)CC1
: