Target
Poly [ADP-ribose] polymerase 1
Ligand
BDBM318017
Substrate
Meas. Tech.
Enzyme Assay
IC50
5050±n/a nM
Citation
 Chedid, MEissa, HOEngler, TAFurness, KWRank, KBWoods, TAWrobleski, AD Pyrido[2,3-d]pyrimidin-4-one compounds as tankyrase inhibitors US Patent  US9624218 Publication Date 4/18/2017 
Target
Name:
Poly [ADP-ribose] polymerase 1
Synonyms:
(ARTD1 or PARP1) 2.4.2.30 ADPRT ARTD1 Human diphtheria toxin-like ADP-ribosyltransferase (ARTD1 or PARP1) NT-PARP-1 PARP1 PPOL Poly [ADP-ribose] polymerase 1 (PARP) Poly [ADP-ribose] polymerase 1 (PARP1) Poly [ADP-ribose] polymerase 1, 28-kDa form Poly [ADP-ribose] polymerase 1, processed C-terminus Poly [ADP-ribose] polymerase-1 Poly(ADP-ribose) polymerase-1 (ARTD1/PARP1) Protein poly-ADP-ribosyltransferase PARP1 | Synonyms=ADPRT
Type:
Mol. Mass.:
113114.22
Organism:
Homo sapiens (Human)
Description:
P09874
Residue:
1014
  
Inhibitor
Name:
BDBM318017
Synonyms:
8-Methyl-2-[4-(1-pyrimidin-2-ylpropyl)piperazin-1-yl]-3,5,6,7-tetrahydropyrido[2,3-d]pyrimidin-4-one, Isomer 1 US9624218, Example 12
Type:
Small organic molecule
Emp. Form.:
C19H27N7O
Mol. Mass.:
369.464
SMILES:
CCC(N1CCN(CC1)c1nc2N(C)CCCc2c(=O)[nH]1)c1ncccn1
: