Target
Poly [ADP-ribose] polymerase 1
Ligand
BDBM318020
Substrate
Meas. Tech.
Enzyme Assay
IC50
5660±698 nM
Citation
 Chedid, MEissa, HOEngler, TAFurness, KWRank, KBWoods, TAWrobleski, AD Pyrido[2,3-d]pyrimidin-4-one compounds as tankyrase inhibitors US Patent  US9624218 Publication Date 4/18/2017 
Target
Name:
Poly [ADP-ribose] polymerase 1
Synonyms:
(ARTD1 or PARP1) 2.4.2.30 ADPRT ARTD1 Human diphtheria toxin-like ADP-ribosyltransferase (ARTD1 or PARP1) NT-PARP-1 PARP1 PPOL Poly [ADP-ribose] polymerase 1 (PARP) Poly [ADP-ribose] polymerase 1 (PARP1) Poly [ADP-ribose] polymerase 1, 28-kDa form Poly [ADP-ribose] polymerase 1, processed C-terminus Poly [ADP-ribose] polymerase-1 Poly(ADP-ribose) polymerase-1 (ARTD1/PARP1) Protein poly-ADP-ribosyltransferase PARP1 | Synonyms=ADPRT
Type:
Mol. Mass.:
113114.22
Organism:
Homo sapiens (Human)
Description:
P09874
Residue:
1014
  
Inhibitor
Name:
BDBM318020
Synonyms:
8-Methyl-2-[4-[(4- methylpyrimidin-2- yl)methyl]piperazin-1-yl]- 3,5,6,7-tetrahydropyrido[2,3- d]pyrimidin-4-one | US9624218, Example 14
Type:
Small organic molecule
Emp. Form.:
C18H25N7O
Mol. Mass.:
355.4374
SMILES:
CN1CCCc2c1nc([nH]c2=O)N1CCN(Cc2nccc(C)n2)CC1
: