Target
cAMP and cAMP-inhibited cGMP 3',5'-cyclic phosphodiesterase 10A
Ligand
BDBM187190
Substrate
Meas. Tech.
Phosphodiesterase Assay
pH
7.4±n/a
Temperature
298.15±n/a K
IC50
200±n/a nM
Comments
extracted
Citation
 Leblond, BChauvignac, CTaverne, TBeausoleil, ECasagrande, ADesire, LPando, MPDonello, JEYang, R Substituted 6,7-dialkoxy-3-isoquinolinol derivatives as inhibitors of phosphodiesterase 10 (PDE 10A) US Patent  US9670181 Publication Date 6/6/2017 
Target
Name:
cAMP and cAMP-inhibited cGMP 3',5'-cyclic phosphodiesterase 10A
Synonyms:
3',5'-cyclic phosphodiesterase PDE10A Phosphodiesterase 10 (PDE10) | Phosphodiesterase 10A
Type:
Protein
Mol. Mass.:
88412.52
Organism:
Homo sapiens (Human)
Description:
Q9Y233
Residue:
1055
  
Inhibitor
Name:
BDBM187190
Synonyms:
US9670181, 68 4-((2-azido-6-methoxyquinolin-3-yl)methyl)-1-ethyl-6,7-dimethoxyisoquinolin-3-ol
Type:
Small organic molecule
Emp. Form.:
C24H23N5O4
Mol. Mass.:
445.4705
SMILES:
CCc1nc(O)c(Cc2cc3cc(OC)ccc3nc2N=[N+]=[N-])c2cc(OC)c(OC)cc12
: