Target
Carbonic anhydrase 2
Ligand
BDBM11031
Substrate
BDBM10856
Meas. Tech.
CA Inhibition Assay
Ki
0.9±n/a nM
Citation
 Thiry, ALedecq, MCecchi, ADogne, JMWouters, JSupuran, CTMasereel, B Indanesulfonamides as carbonic anhydrase inhibitors. Toward structure-based design of selective inhibitors of the tumor-associated isozyme CA IX. J Med Chem 49:2743-9 (2006)  
Target
Name:
Carbonic anhydrase 2
Synonyms:
CA-II CAC Carbonate dehydratase II Carbonic anhydrase 2 (CA-II) Carbonic anhydrase C Carbonic anhydrase II (CA-II) Carbonic anhydrase II (hCA II) | Carbonic anhydrase isoenzyme II (hCA II)
Type:
Enzyme
Mol. Mass.:
29250.71
Organism:
Homo sapiens (Human)
Description:
P00918
Residue:
260
  
Inhibitor
Name:
BDBM11031
Synonyms:
2-propyl-N-(5-sulfamoyl-2,3-dihydro-1H-inden-2-yl)pentanamide CHEMBL381730 | Indanesulfonamide Derivative 12a
Type:
Small organic molecule
Emp. Form.:
C17H26N2O3S
Mol. Mass.:
338.465
SMILES:
CCCC(CCC)C(=O)NC1Cc2ccc(cc2C1)S(N)(=O)=O
:
Substrate
Name:
BDBM10856
Synonyms:
Carbon Dioxide | methanedione
Type:
Small organic molecule
Emp. Form.:
CO2
Mol. Mass.:
44.0095
SMILES:
O=C=O
: