Target
Carbonic anhydrase 2
Ligand
BDBM11032
Substrate
BDBM10856
Meas. Tech.
CA Inhibition Assay
Ki
32±n/a nM
Citation
 Thiry, ALedecq, MCecchi, ADogne, JMWouters, JSupuran, CTMasereel, B Indanesulfonamides as carbonic anhydrase inhibitors. Toward structure-based design of selective inhibitors of the tumor-associated isozyme CA IX. J Med Chem 49:2743-9 (2006)  
Target
Name:
Carbonic anhydrase 2
Synonyms:
CA-II CAC Carbonate dehydratase II Carbonic anhydrase 2 (CA-II) Carbonic anhydrase C Carbonic anhydrase II (CA-II) Carbonic anhydrase II (hCA II) | Carbonic anhydrase isoenzyme II (hCA II)
Type:
Enzyme
Mol. Mass.:
29250.71
Organism:
Homo sapiens (Human)
Description:
P00918
Residue:
260
  
Inhibitor
Name:
BDBM11032
Synonyms:
1-cyclohexylamido-5-sulfonamidoindane Indanesulfonamide Derivative 11b | N-(5-sulfamoyl-2,3-dihydro-1H-inden-1-yl)cyclohexanecarboxamide
Type:
Small organic molecule
Emp. Form.:
C16H22N2O3S
Mol. Mass.:
322.422
SMILES:
NS(=O)(=O)c1ccc2C(CCc2c1)NC(=O)C1CCCCC1
:
Substrate
Name:
BDBM10856
Synonyms:
Carbon Dioxide | methanedione
Type:
Small organic molecule
Emp. Form.:
CO2
Mol. Mass.:
44.0095
SMILES:
O=C=O
: