Target
Mitogen-activated protein kinase 1
Ligand
BDBM318338
Substrate
Meas. Tech.
Z′-LYTE Kinase Assay
IC50
<50±n/a nM
Citation
 Li, LWu, TFeng, JRen, PLiu, Y Inhibitors of ERK and methods of use US Patent  US9624228 Publication Date 4/18/2017 
Target
Name:
Mitogen-activated protein kinase 1
Synonyms:
ERK2 Extracellular signal-regulated kinase 2 Extracellular signal-regulated kinase 2 (ERK2) MAPK 2 MK01_HUMAN Mitogen-activated protein kinase 1 (ERK-2) Mitogen-activated protein kinase 2 PRKM2 | p42-MAPK
Type:
Ser/Thr Protein Kinase
Mol. Mass.:
41392.76
Organism:
Homo sapiens (Human)
Description:
P28482
Residue:
360
  
Inhibitor
Name:
BDBM318338
Synonyms:
US10301317, Example 295 | US9624228, Example 295
Type:
Small organic molecule
Emp. Form.:
C24H25N7O2S
Mol. Mass.:
475.566
SMILES:
COc1ncc(cn1)-c1n[nH]c2cc3NC(=O)N(Cc3cc12)[C@@H]1CCCN(Cc2cccs2)C1
: