Target
Type-2 angiotensin II receptor
Ligand
BDBM318430
Substrate
Meas. Tech.
Receptor Binding Assay
IC50
101±n/a nM
Citation
 McCarthy, TDNaylor, A Heterocyclic compounds and methods for their use US Patent  US9624234 Publication Date 4/18/2017 
Target
Name:
Type-2 angiotensin II receptor
Synonyms:
AGTR2 AT2 Angiotensin II type 2 (AT-2) receptor Type-2 angiotensin II receptor
Type:
Enzyme Catalytic Domain
Mol. Mass.:
41201.61
Organism:
Homo sapiens (Human)
Description:
Angiotensin II, central 0 0::P50052
Residue:
363
  
Inhibitor
Name:
BDBM318430
Synonyms:
(2S,4R)-1-(2,2-diphenylacetyl)-4-((3-phenylpropyl)oxy)piperidine-2-carboxylic acid | US9624234, 41
Type:
Small organic molecule
Emp. Form.:
C29H31NO4
Mol. Mass.:
457.5607
SMILES:
OC(=O)[C@@H]1C[C@@H](CCN1C(=O)C(c1ccccc1)c1ccccc1)OCCCc1ccccc1
: