Target
DNA-(apurinic or apyrimidinic site) endonuclease
Ligand
BDBM318451
Substrate
Meas. Tech.
Inhibition Assay
Ki
17000±n/a nM
Citation
 Gold, BIXie, XSrinivasan, AWang, L Compounds and methods for inhibition of AP endonuclease-1/redox factor-1 (HAPE1) activity US Patent  US9624235 Publication Date 4/18/2017 
Target
Name:
DNA-(apurinic or apyrimidinic site) endonuclease
Synonyms:
APE APEX APEX1_HUMAN Apurinic-apyrimidinic endonuclease 1 (APE-1) DNA-(apurinic or apyrimidinic site) lyase REF1
Type:
Protein
Mol. Mass.:
35560.12
Organism:
Homo sapiens (Human)
Description:
P27695
Residue:
318
  
Inhibitor
Name:
BDBM318451
Synonyms:
NSC107215 | US9624235, Compound 10
Type:
Small organic molecule
Emp. Form.:
C17H21N3O4
Mol. Mass.:
331.3663
SMILES:
C\C=C\C(=O)NCCCCNC(=O)\C=C\c1ccc(cc1)[N+]([O-])=O
: