Target
Bromodomain-containing protein 4 [49-170]
Ligand
BDBM318453
Substrate
Meas. Tech.
AlphaScreen Assay
IC50
<100±n/a nM
Citation
 Combs, APSparks, RBMaduskuie, Jr., TP Tricyclic heterocycles as BET protein inhibitors US Patent  US9624241 Publication Date 4/18/2017 
Target
Name:
Bromodomain-containing protein 4 [49-170]
Synonyms:
BRD4 BRD4-BD1 (aa 49-170) Bromodomain containing 4 (aa 49-170) Bromodomain-containing protein 4 (BRD4)(49-170) HUNK1
Type:
Enzyme Catalytic Domain
Mol. Mass.:
14593.14
Organism:
Homo sapiens (Human)
Description:
aa 49-170 (BRD4-BD1)
Residue:
122
  
Inhibitor
Name:
BDBM318453
Synonyms:
US10464947, Example 1B US9624241, Example 1B
Type:
Small organic molecule
Emp. Form.:
C20H17N3O3
Mol. Mass.:
347.3673
SMILES:
Cc1noc(C)c1-c1ccc2[nH]c(=O)n3C(COc1c23)c1ccccc1
: