Target
Bromodomain-containing protein 4 [49-170]
Ligand
BDBM318479
Substrate
Meas. Tech.
AlphaScreen Assay
IC50
<100±n/a nM
Citation
 Combs, APSparks, RBMaduskuie, Jr., TP Tricyclic heterocycles as BET protein inhibitors US Patent  US9624241 Publication Date 4/18/2017 
Target
Name:
Bromodomain-containing protein 4 [49-170]
Synonyms:
BRD4 BRD4-BD1 (aa 49-170) Bromodomain containing 4 (aa 49-170) Bromodomain-containing protein 4 (BRD4)(49-170) HUNK1
Type:
Enzyme Catalytic Domain
Mol. Mass.:
14593.14
Organism:
Homo sapiens (Human)
Description:
aa 49-170 (BRD4-BD1)
Residue:
122
  
Inhibitor
Name:
BDBM318479
Synonyms:
7-(3,5-Dimethylisoxazol-4-yl)-N-isopropyl-4-phenyl-4,5-dihydroimidazo[1,5,4-de][1,4]benzoxazin-2-amine US11498926, Example 25 | US9624241, Example 25
Type:
Small organic molecule
Emp. Form.:
C23H24N4O2
Mol. Mass.:
388.4623
SMILES:
CC(C)Nc1nc2ccc(-c3c(C)noc3C)c3OCC(c4ccccc4)n1c23
: