Target
Type-2 angiotensin II receptor
Ligand
BDBM318770
Substrate
Meas. Tech.
Receptor Binding Assay
IC50
3358±n/a nM
Citation
 McCarthy, TDNaylor, A Heterocyclic compounds and methods of their use US Patent  US9624243 Publication Date 4/18/2017 
Target
Name:
Type-2 angiotensin II receptor
Synonyms:
AGTR2 AT2 Angiotensin II type 2 (AT-2) receptor Type-2 angiotensin II receptor
Type:
Enzyme Catalytic Domain
Mol. Mass.:
41201.61
Organism:
Homo sapiens (Human)
Description:
Angiotensin II, central 0 0::P50052
Residue:
363
  
Inhibitor
Name:
BDBM318770
Synonyms:
(2S,4S)-1-(2,2-diphenylacetyl)-4-(3,3-diphenyluriedo)-pyrrolidine-2-carboxylic acid | US9624243, 64
Type:
Small organic molecule
Emp. Form.:
C32H29N3O4
Mol. Mass.:
519.5904
SMILES:
OC(=O)[C@@H]1C[C@@H](CN1C(=O)C(c1ccccc1)c1ccccc1)NC(=O)N(c1ccccc1)c1ccccc1
: