Target
Interleukin-1 receptor-associated kinase 4
Ligand
BDBM318831
Substrate
Meas. Tech.
Enzymatic Assay
IC50
>5000±n/a nM
Citation
 Chen, XLan, RJorand-Lebrun, CYu, HGoutopoulos, A Pyridazinone macrocycles as IRAK inhibitors and uses thereof US Patent  US9624246 Publication Date 4/18/2017 
Target
Name:
Interleukin-1 receptor-associated kinase 4
Synonyms:
IRAK-4 IRAK4_HUMAN Interleukin-1 receptor-associated kinase 4 (IRAK4) | Renal carcinoma antigen NY-REN-64
Type:
Protein
Mol. Mass.:
51519.08
Organism:
Homo sapiens (Human)
Description:
Q9NWZ3
Residue:
460
  
Inhibitor
Name:
BDBM318831
Synonyms:
US10517872, Compound 8 | US9624246, Compound 8
Type:
Small organic molecule
Emp. Form.:
C19H19N7O4
Mol. Mass.:
409.3987
SMILES:
Cn1cc2NC(=O)c3cccc(Cn4nc(OCCCNC(=O)c2n1)ccc4=O)n3
: