Target
Interleukin-1 receptor-associated kinase 1 [194-712]
Ligand
BDBM318832
Substrate
Meas. Tech.
Enzymatic Assay
IC50
<100±n/a nM
Citation
 Chen, XLan, RJorand-Lebrun, CYu, HGoutopoulos, A Pyridazinone macrocycles as IRAK inhibitors and uses thereof US Patent  US9624246 Publication Date 4/18/2017 
Target
Name:
Interleukin-1 receptor-associated kinase 1 [194-712]
Synonyms:
IRAK IRAK1_HUMAN | Interleukin-1 receptor-associated kinase 1 (IRAK1)
Type:
Enzyme Catalytic Domain
Mol. Mass.:
55943.99
Organism:
Homo sapiens (Human)
Description:
aa 194-712
Residue:
519
  
Inhibitor
Name:
BDBM318832
Synonyms:
US10517872, Compound 9 | US9624246, Compound 9
Type:
Small organic molecule
Emp. Form.:
C23H25N7O5
Mol. Mass.:
479.4885
SMILES:
O=C1NCCCOc2ccc(=O)n(Cc3cccc(n3)C(=O)Nc3cn(nc13)C1CCOCC1)n2
: