Target
Interleukin-1 receptor-associated kinase 1 [194-712]
Ligand
BDBM318833
Substrate
Meas. Tech.
Enzymatic Assay
IC50
3000±n/a nM
Citation
 Chen, XLan, RJorand-Lebrun, CYu, HGoutopoulos, A Pyridazinone macrocycles as IRAK inhibitors and uses thereof US Patent  US9624246 Publication Date 4/18/2017 
Target
Name:
Interleukin-1 receptor-associated kinase 1 [194-712]
Synonyms:
IRAK IRAK1_HUMAN | Interleukin-1 receptor-associated kinase 1 (IRAK1)
Type:
Enzyme Catalytic Domain
Mol. Mass.:
55943.99
Organism:
Homo sapiens (Human)
Description:
aa 194-712
Residue:
519
  
Inhibitor
Name:
BDBM318833
Synonyms:
US10517872, Compound 10 | US9624246, Compound 10
Type:
Small organic molecule
Emp. Form.:
C22H25N7O4
Mol. Mass.:
451.4784
SMILES:
CC(C)(C)n1cc2NC(=O)c3cccc(Cn4nc(OCCCNC(=O)c2n1)ccc4=O)n3
: