Target
CREB-binding protein
Ligand
BDBM318844
Substrate
Meas. Tech.
AlphaScreen In-Vitro Binding Assay
IC50
21600±n/a nM
Citation
 Blank, JBold, GCotesta, SGuagnano, VRueeger, H Pyrazolo-pyrrolidin-4-one derivatives as bet inhibitors and their use in the treatment of disease US Patent  US9624247 Publication Date 4/18/2017 
Target
Name:
CREB-binding protein
Synonyms:
CBP CREB-binding protein (CBP) CREBBP
Type:
Transcription Coactivator
Mol. Mass.:
265411.66
Organism:
Homo sapiens (Human)
Description:
Q92793
Residue:
2442
  
Inhibitor
Name:
BDBM318844
Synonyms:
6-(4-chlorophenyl)-3-cyclopropyl-5-(3-(difluoromethyl)-8-methyl-[1,2,4]triazolo[4,3-a]pyridin-6-yl)-1-methyl-5,6-dihydropyrrolo[3,4-c]pyrazol-4(1H)-one | US9624247, Example 6
Type:
Small organic molecule
Emp. Form.:
C23H21ClN6O2
Mol. Mass.:
448.905
SMILES:
COc1cc(cc2n(C)nnc12)N1C(c2c(C1=O)c(nn2C)C1CC1)c1ccc(Cl)cc1
: