Target
Bromodomain-containing protein 2
Ligand
BDBM318849
Substrate
Meas. Tech.
In-Vitro Binding Assay
IC50
46.0±n/a nM
Citation
 Blank, JBold, GCotesta, SGuagnano, VRueeger, H Pyrazolo-pyrrolidin-4-one derivatives as bet inhibitors and their use in the treatment of disease US Patent  US9624247 Publication Date 4/18/2017 
Target
Name:
Bromodomain-containing protein 2
Synonyms:
BRD2 Bromodomain and extra-terminal motif (BET) Bromodomain-containing protein 2 (BRD2) RING3
Type:
Protein
Mol. Mass.:
88085.95
Organism:
Homo sapiens (Human)
Description:
P25440
Residue:
801
  
Inhibitor
Name:
BDBM318849
Synonyms:
(R)-6-(4-chlorophenyl)-5-(3,8-dimethyl-[1,2,4]triazolo[4,3-a]pyridin-6-yl)-3-(2-methoxypyridin-3-yl)-5,6-dihydropyrrolo[3,4-c]pyrazol-4(1H)-one | US9624247, Example 11
Type:
Small organic molecule
Emp. Form.:
C25H20ClN7O2
Mol. Mass.:
485.925
SMILES:
COc1ncccc1-c1n[nH]c2[C@H](N(C(=O)c12)c1cc(C)c2nnc(C)n2c1)c1ccc(Cl)cc1
: