Target
Bromodomain-containing protein 4
Ligand
BDBM318852
Substrate
Meas. Tech.
In-Vitro Binding Assay
IC50
30.0±n/a nM
Citation
 Blank, JBold, GCotesta, SGuagnano, VRueeger, H Pyrazolo-pyrrolidin-4-one derivatives as bet inhibitors and their use in the treatment of disease US Patent  US9624247 Publication Date 4/18/2017 
Target
Name:
Bromodomain-containing protein 4
Synonyms:
BRD4 Bromodomain-containing protein 4 (BRD4) Protein HUNK1
Type:
Protein
Mol. Mass.:
152264.84
Organism:
Homo sapiens (Human)
Description:
O60885
Residue:
1362
  
Inhibitor
Name:
BDBM318852
Synonyms:
(R)-6-(4-chlorophenyl)-3-cyclopropyl-5-(8-methoxy-3-methyl-[1,2,4]triazolo[4,3-a]-pyridin-6-yl)-1-methyl-5,6-dihydropyrrolo[3,4-c]pyrazol-4(1H)-one | US9624247, Example 14
Type:
Small organic molecule
Emp. Form.:
C23H21ClN6O2
Mol. Mass.:
448.905
SMILES:
COc1cc(cn2c(C)nnc12)N1[C@@H](c2c(C1=O)c(nn2C)C1CC1)c1ccc(Cl)cc1
: