Target
Bromodomain-containing protein 4
Ligand
BDBM318863
Substrate
Meas. Tech.
In-Vitro Binding Assay
IC50
36.0±n/a nM
Citation
 Blank, JBold, GCotesta, SGuagnano, VRueeger, H Pyrazolo-pyrrolidin-4-one derivatives as bet inhibitors and their use in the treatment of disease US Patent  US9624247 Publication Date 4/18/2017 
Target
Name:
Bromodomain-containing protein 4
Synonyms:
BRD4 Bromodomain-containing protein 4 (BRD4) Protein HUNK1
Type:
Protein
Mol. Mass.:
152264.84
Organism:
Homo sapiens (Human)
Description:
O60885
Residue:
1362
  
Inhibitor
Name:
BDBM318863
Synonyms:
US9624247, Example 27 | tert-butyl (6-(6-(4-chlorophenyl)-3-cyclopropyl-1-methyl-4-oxopyrrolo[3,4-c]pyrazol-5(1H,4H,6H)-yl)-3-methyl-[1,2,4]triazolo[4,3-a]pyridin-8-yl)carbamate
Type:
Small organic molecule
Emp. Form.:
C27H28ClN7O3
Mol. Mass.:
534.009
SMILES:
Cc1nnc2c(NC(=O)OC(C)(C)C)cc(cn12)N1C(c2c(C1=O)c(nn2C)C1CC1)c1ccc(Cl)cc1
: