Target
Epidermal growth factor receptor [T790M,L858R]
Ligand
BDBM318909
Substrate
Meas. Tech.
In vitro assay
IC50
<100±n/a nM
Citation
 Qian, XZhu, Y Substituted quinazolines for inhibiting kinase activity US Patent  US10172868 Publication Date 1/8/2019 
Target
Name:
Epidermal growth factor receptor [T790M,L858R]
Synonyms:
EGFR EGFR_HUMAN ERBB1 Epidermal growth factor receptor (EGFR)(T790M/L858R) Epidermal growth factor receptor (T790M, L858R) Epidermal growth factor receptor(L858R, T790M) | HER1
Type:
Mol. Mass.:
134353.72
Organism:
Homo sapiens (Human)
Description:
P00533[T790M,L858R]
Residue:
1210
  
Inhibitor
Name:
BDBM318909
Synonyms:
N-(3-(2-((4-((1-(2-hydroxyethyl)piperidin-4-yl)oxy)phenyl)amino)quinazolin-8-yl)phenyl)acrylamide US10653701, Compound C137 | US11304957, Compound C137
Type:
Small organic molecule
Emp. Form.:
C30H31N5O3
Mol. Mass.:
509.5988
SMILES:
OCCN1CCC(CC1)Oc1ccc(Nc2ncc3cccc(-c4cccc(NC(=O)C=C)c4)c3n2)cc1
: