Target
Fibroblast growth factor receptor 2
Ligand
BDBM318915
Substrate
Meas. Tech.
In vitro assay
IC50
300±n/a nM
Citation
 Qian, XZhu, Y Substituted quinazolines for inhibiting kinase activity US Patent  US10172868 Publication Date 1/8/2019 
Target
Name:
Fibroblast growth factor receptor 2
Synonyms:
BEK FGFR-2 FGFR2 Fibroblast growth factor receptor 2 (FGFR2) KGFR Keratinocyte growth factor receptor VEGF-receptor 2 and Fibroblast growth factor receptor 2
Type:
Enzyme
Mol. Mass.:
92015.45
Organism:
Homo sapiens (Human)
Description:
P21802
Residue:
821
  
Inhibitor
Name:
BDBM318915
Synonyms:
N-(3-(2-((2-fluoro-4-(4-(2-hydroxyethyl)piperazin-1-yl)phenyl)amino)quinazolin-8-yl)phenyl)acrylamide US10653701, Compound C147 | US11304957, Compound C147
Type:
Small organic molecule
Emp. Form.:
C29H29FN6O2
Mol. Mass.:
512.578
SMILES:
OCCN1CCN(CC1)c1ccc(Nc2ncc3cccc(-c4cccc(NC(=O)C=C)c4)c3n2)c(F)c1
: