Target
Epidermal growth factor receptor [T790M,L858R]
Ligand
BDBM318917
Substrate
Meas. Tech.
In vitro assay
IC50
<100±n/a nM
Citation
 Qian, XZhu, Y Substituted quinazolines for inhibiting kinase activity US Patent  US10172868 Publication Date 1/8/2019 
Target
Name:
Epidermal growth factor receptor [T790M,L858R]
Synonyms:
EGFR EGFR_HUMAN ERBB1 Epidermal growth factor receptor (EGFR)(T790M/L858R) Epidermal growth factor receptor (T790M, L858R) Epidermal growth factor receptor(L858R, T790M) | HER1
Type:
Mol. Mass.:
134353.72
Organism:
Homo sapiens (Human)
Description:
P00533[T790M,L858R]
Residue:
1210
  
Inhibitor
Name:
BDBM318917
Synonyms:
N-(3-(2-((2,3-difluoro-4-(4-methylpiperazin-1-yl)phenyl)amino)quinazolin-8-yl)phenyl)acrylamide US10653701, Compound C156 | US11304957, Compound C156
Type:
Small organic molecule
Emp. Form.:
C28H26F2N6O
Mol. Mass.:
500.5424
SMILES:
CN1CCN(CC1)c1ccc(Nc2ncc3cccc(-c4cccc(NC(=O)C=C)c4)c3n2)c(F)c1F
: