Target
Sodium channel protein type 9 subunit alpha
Ligand
BDBM318921
Substrate
Meas. Tech.
In Vitro Electrophysiology
IC50
560±n/a nM
Citation
 Sole Feu, LFonquerna Pou, S Aminoindazole derivatives as sodium channel inhibitors US Patent  US10173985 Publication Date 1/8/2019 
Target
Name:
Sodium channel protein type 9 subunit alpha
Synonyms:
NENA Peripheral sodium channel 1 SCN9A_HUMAN Voltage-gated sodium channel subunit Nav1.7 hNE-Na
Type:
Protein
Mol. Mass.:
226375.97
Organism:
Homo sapiens (Human)
Description:
Q15858
Residue:
1988
  
Inhibitor
Name:
BDBM318921
Synonyms:
6-(2-(2,2,3,3,3-pentafluoropropoxy)phenyl)-1H-indazol-3-amine | US10173985, Example 14
Type:
Small organic molecule
Emp. Form.:
C16H12F5N3O
Mol. Mass.:
357.278
SMILES:
Nc1n[nH]c2cc(ccc12)-c1ccccc1OCC(F)(F)C(F)(F)F
: