Target
Sodium channel protein type 5 subunit alpha
Ligand
BDBM318922
Substrate
Meas. Tech.
In Vitro Electrophysiology
IC50
>33000±n/a nM
Citation
 Sole Feu, LFonquerna Pou, S Aminoindazole derivatives as sodium channel inhibitors US Patent  US10173985 Publication Date 1/8/2019 
Target
Name:
Sodium channel protein type 5 subunit alpha
Synonyms:
HH1 SCN5A_HUMAN Sodium channel protein type 5 subunit alpha/beta-1/beta-2 Voltage-gated sodium channel subunit alpha Nav1.5
Type:
Enzyme
Mol. Mass.:
226908.60
Organism:
Homo sapiens (Human)
Description:
Q14524
Residue:
2016
  
Inhibitor
Name:
BDBM318922
Synonyms:
6-(3-fluoro-2-(2,2,3,3,3-pentafluoropropoxy)phenyl)-1-methyl-1H-indazol-3-amine | US10173985, Example 22
Type:
Small organic molecule
Emp. Form.:
C17H13F6N3O
Mol. Mass.:
389.295
SMILES:
Cn1nc(N)c2ccc(cc12)-c1cccc(F)c1OCC(F)(F)C(F)(F)F
: