Target
NADPH oxidase 4
Ligand
BDBM318938
Substrate
Meas. Tech.
Nox4 Assay
IC50
1680±n/a nM
Citation
 Wikström, PWalum, EWilcke, M N2-(3,4-dimethylphenyl)-6-((4-(p-tolyl)piperazin-1-yl)methyl)-1,3,5-triazine-2,4-diamine US Patent  US10173988 Publication Date 1/8/2019 
Target
Name:
NADPH oxidase 4
Synonyms:
KOX-1 Kidney superoxide-producing NADPH oxidase NOX4_HUMAN Renal NAD(P)H-oxidase
Type:
PROTEIN
Mol. Mass.:
66954.54
Organism:
Homo sapiens (Human)
Description:
ChEMBL_792879
Residue:
578
  
Inhibitor
Name:
BDBM318938
Synonyms:
US10173988, Compound C
Type:
Small organic molecule
Emp. Form.:
C23H29N7
Mol. Mass.:
403.5233
SMILES:
Cc1cccc(c1)N1CCN(Cc2nc(N)nc(Nc3ccc(C)c(C)c3)n2)CC1
: